chore(deps): bump the github-actions group across 1 directory with 6 updates #10984
Annotations
2 errors
|
io.sentry.uitest.android.AutomaticSpansTest ► ttidTtfdSpans:
sentry-android-integration-tests/sentry-uitest-android/src/androidTest/java/io/sentry/uitest/android/BaseUiTest.kt#L125
Failed test found in:
sentry-android-integration-tests/sentry-uitest-android/build/outputs/androidTest-results/connected/release/TEST-emulator-5554 - 11-_sentry-android-integration-tests_sentry-uitest-android-.xml
Error:
java.lang.RuntimeException: java.util.concurrent.ExecutionException: androidx.test.espresso.IdlingResourceTimeoutException: Wait for [relay-requests] to become idle timed out
|
|
AGP Matrix Release - AGP 8.9.0 - Integrations false
The process '/usr/bin/sh' failed with exit code 1
|